Reaction Details
TargetThyroid hormone receptor beta
LigandBDBM50375349
Substrate/Competitorn/a
Meas. Tech.ChEMBL_471201 (CHEMBL939180)
Kd 49±n/a nM
Citation Ocasio, CAScanlan, TS Characterization of thyroid hormone receptor alpha (TRalpha)-specific analogs with varying inner- and outer-ring substituents. Bioorg Med Chem16:762-70 (2008) 
 
Thyroid hormone receptor beta
Name:Thyroid hormone receptor beta
Type:Receptor
Mol. Mass.:52793.62
Organism:Homo sapiens (Human)
Description:Recombinant hThR was obtained from nuclear extracts from SF9 cells infected with baculovirus vectors encoding for ThRbeta 1.
Residue:461
BDBM50375349
NameBDBM50375349
Synonyms:CHEMBL260482
TypeSmall organic molecule
Emp. Form.C19H16I2N2O4
Mol. Mass.590.1503
SMILESOc1[nH]c(=O)[nH]c1Cc1cc(I)c(Oc2ccc(O)c(c2)C2CC2)c(I)c1