Reaction Details
TargetThyroid hormone receptor beta
LigandBDBM50375347
Substrate/Competitorn/a
Meas. Tech.ChEMBL_471201 (CHEMBL939180)
Kd 119±n/a nM
Citation Ocasio, CAScanlan, TS Characterization of thyroid hormone receptor alpha (TRalpha)-specific analogs with varying inner- and outer-ring substituents. Bioorg Med Chem16:762-70 (2008) 
 
Thyroid hormone receptor beta
Name:Thyroid hormone receptor beta
Type:Receptor
Mol. Mass.:52793.62
Organism:Homo sapiens (Human)
Description:Recombinant hThR was obtained from nuclear extracts from SF9 cells infected with baculovirus vectors encoding for ThRbeta 1.
Residue:461
BDBM50375347
NameBDBM50375347
Synonyms:CHEMBL264410
TypeSmall organic molecule
Emp. Form.C17H14I2N2O5
Mol. Mass.580.1124
SMILESCOc1cc(Oc2c(I)cc(Cc3[nH]c(=O)[nH]c3O)cc2I)ccc1O