Reaction Details
TargetThyroid hormone receptor beta
LigandBDBM50375350
Substrate/Competitorn/a
Meas. Tech.ChEMBL_471201 (CHEMBL939180)
Kd 18.4±n/a nM
Citation Ocasio, CAScanlan, TS Characterization of thyroid hormone receptor alpha (TRalpha)-specific analogs with varying inner- and outer-ring substituents. Bioorg Med Chem16:762-70 (2008) 
 
Thyroid hormone receptor beta
Name:Thyroid hormone receptor beta
Type:Receptor
Mol. Mass.:52793.62
Organism:Homo sapiens (Human)
Description:Recombinant hThR was obtained from nuclear extracts from SF9 cells infected with baculovirus vectors encoding for ThRbeta 1.
Residue:461
BDBM50375350
NameBDBM50375350
Synonyms:CHEMBL263631
TypeSmall organic molecule
Emp. Form.C19H18Br2N2O4
Mol. Mass.498.165
SMILESCC(C)c1cc(Oc2c(Br)cc(Cc3[nH]c(=O)[nH]c3O)cc2Br)ccc1O