Reaction Details
TargetCruzipain
LigandBDBM50108847
Substrate/Competitorn/a
Meas. Tech.ChEMBL_471525 (CHEMBL938460)
Ki 1±n/a nM
Citation Freitas, RFOprea, TIMontanari, CA 2D QSAR and similarity studies on cruzain inhibitors aimed at improving selectivity over cathepsin L. Bioorg Med Chem16:838-53 (2008) 
 
Cruzipain
Name:Cruzipain
Type:Protein
Mol. Mass.:49831.41
Organism:Trypanosoma cruzi
Description:P25779
Residue:467
BDBM50108847
NameBDBM50108847
Synonyms:CHEMBL162474 {1-[1-Benzyl-2-oxo-3-(3-phenyl-propylsulfanyl)-propylcarbamoyl]-3-methyl-butyl}-carbamic acid benzyl ester
TypeSmall organic molecule
Emp. Form.C33H40N2O4S
Mol. Mass.560.747
SMILESCC(C)C[C@H](NC(=O)OCc1ccccc1)C(=O)N[C@@H](Cc1ccccc1)C(=O)CSCCCc1ccccc1