Reaction Details
TargetCruzipain
LigandBDBM50108856
Substrate/Competitorn/a
Meas. Tech.ChEMBL_471525 (CHEMBL938460)
Ki 2±n/a nM
Citation Freitas, RFOprea, TIMontanari, CA 2D QSAR and similarity studies on cruzain inhibitors aimed at improving selectivity over cathepsin L. Bioorg Med Chem16:838-53 (2008) 
 
Cruzipain
Name:Cruzipain
Type:Protein
Mol. Mass.:49831.41
Organism:Trypanosoma cruzi
Description:P25779
Residue:467
BDBM50108856
NameBDBM50108856
Synonyms:CHEMBL103238 {(S)-1-[(S)-1-Benzyl-2-oxo-3-(3-phenyl-propylsulfanyl)-propylcarbamoyl]-2-phenyl-ethyl}-carbamic acid benzyl ester | {1-[1-Benzyl-2-oxo-3-(3-phenyl-propylsulfanyl)-propylcarbamoyl]-2-phenyl-ethyl}-carbamic acid benzyl ester
TypeSmall organic molecule
Emp. Form.C36H38N2O4S
Mol. Mass.594.763
SMILESO=C(N[C@@H](Cc1ccccc1)C(=O)N[C@@H](Cc1ccccc1)C(=O)CSCCCc1ccccc1)OCc1ccccc1