Reaction Details
TargetCruzipain
LigandBDBM50108861
Substrate/Competitorn/a
Meas. Tech.ChEMBL_471525 (CHEMBL938460)
Ki 10.4±n/a nM
Citation Freitas, RFOprea, TIMontanari, CA 2D QSAR and similarity studies on cruzain inhibitors aimed at improving selectivity over cathepsin L. Bioorg Med Chem16:838-53 (2008) 
 
Cruzipain
Name:Cruzipain
Type:Protein
Mol. Mass.:49831.41
Organism:Trypanosoma cruzi
Description:P25779
Residue:467
BDBM50108861
NameBDBM50108861
Synonyms:CHEMBL348117 {1-[1-Benzyl-2-oxo-3-(1,1,3,3-tetramethyl-butylsulfanyl)-propylcarbamoyl]-2-phenyl-ethyl}-carbamic acid benzyl ester
TypeSmall organic molecule
Emp. Form.C35H44N2O4S
Mol. Mass.588.8
SMILESCC(C)(C)CC(C)(C)SCC(=O)[C@H](Cc1ccccc1)NC(=O)[C@H](Cc1ccccc1)NC(=O)OCc1ccccc1