Reaction Details
TargetCruzipain
LigandBDBM50108868
Substrate/Competitorn/a
Meas. Tech.ChEMBL_471525 (CHEMBL938460)
Ki 15±n/a nM
Citation Freitas, RFOprea, TIMontanari, CA 2D QSAR and similarity studies on cruzain inhibitors aimed at improving selectivity over cathepsin L. Bioorg Med Chem16:838-53 (2008) 
 
Cruzipain
Name:Cruzipain
Type:Protein
Mol. Mass.:49831.41
Organism:Trypanosoma cruzi
Description:P25779
Residue:467
BDBM50108868
NameBDBM50108868
Synonyms:CHEMBL351721 benzyl (S)-1-((S)-4-(2-(methylamino)-2-oxoethylthio)-3-oxo-1-phenylbutan-2-ylamino)-1-oxo-3-phenylpropan-2-ylcarbamate
TypeSmall organic molecule
Emp. Form.C30H33N3O5S
Mol. Mass.547.665
SMILESCNC(=O)CSCC(=O)[C@H](Cc1ccccc1)NC(=O)[C@H](Cc1ccccc1)NC(=O)OCc1ccccc1