Reaction Details
TargetCannabinoid receptor 1
LigandBDBM50375381
Substrate/Competitorn/a
Meas. Tech.ChEMBL_471724 (CHEMBL920996)
IC50 1300±n/a nM
Citation Ohta, HIshizaka, TTatsuzuki, MYoshinaga, MIida, IYamaguchi, TTomishima, YFutaki, NToda, YSaito, S Imine derivatives as new potent and selective CB2 cannabinoid receptor agonists with an analgesic action. Bioorg Med Chem16:1111-24 (2008) 
 
Cannabinoid receptor 1
Name:Cannabinoid receptor 1
Type:G Protein-Coupled Receptor (GPCR)
Mol. Mass.:52868.96
Organism:Homo sapiens (Human)
Description:P21554
Residue:472
BDBM50375381
NameBDBM50375381
Synonyms:CHEMBL272754
TypeSmall organic molecule
Emp. Form.C21H26F3N3O
Mol. Mass.393.4458
SMILESCc1c(cccc1C(F)(F)F)C(=O)N=c1cc(n(C)n1CC1CC1)C(C)(C)C