Reaction Details
TargetCannabinoid receptor 1
LigandBDBM21311
Substrate/Competitorn/a
Meas. Tech.ChEMBL_471740 (CHEMBL921012)
IC50 330±n/a nM
Citation Ohta, HIshizaka, TTatsuzuki, MYoshinaga, MIida, IYamaguchi, TTomishima, YFutaki, NToda, YSaito, S Imine derivatives as new potent and selective CB2 cannabinoid receptor agonists with an analgesic action. Bioorg Med Chem16:1111-24 (2008) 
 
Cannabinoid receptor 1
Name:Cannabinoid receptor 1
Type:G Protein-Coupled Receptor (GPCR)
Mol. Mass.:52868.96
Organism:Homo sapiens (Human)
Description:P21554
Residue:472
BDBM21311
NameBDBM21311
Synonyms:4-(2-{3-[(2,2,3,3-tetramethylcyclopropyl)carbonyl]-1H-indol-1-yl}ethyl)morpholine Morpholino-ethyl analogue, 32
TypeSmall organic molecule
Emp. Form.C22H30N2O2
Mol. Mass.354.4858
SMILESCC1(C)C(C(=O)c2cn(CCN3CCOCC3)c3ccccc23)C1(C)C