Reaction Details
TargetCannabinoid receptor 2
LigandBDBM50375392
Substrate/Competitorn/a
Meas. Tech.ChEMBL_471723 (CHEMBL920995)
IC50 3.7±n/a nM
Citation Ohta, HIshizaka, TTatsuzuki, MYoshinaga, MIida, IYamaguchi, TTomishima, YFutaki, NToda, YSaito, S Imine derivatives as new potent and selective CB2 cannabinoid receptor agonists with an analgesic action. Bioorg Med Chem16:1111-24 (2008) 
 
Cannabinoid receptor 2
Name:Cannabinoid receptor 2
Type:G Protein-Coupled Receptor (GPCR)
Mol. Mass.:39690.94
Organism:Homo sapiens (Human)
Description:P34972
Residue:360
BDBM50375392
NameBDBM50375392
Synonyms:CHEMBL410243
TypeSmall organic molecule
Emp. Form.C20H25F4N3O2
Mol. Mass.415.425
SMILESCCOCCn1n(C)c(c\c1=N/C(=O)c1cccc(c1F)C(F)(F)F)C(C)(C)C