Reaction Details
TargetCannabinoid receptor 2
LigandBDBM50375394
Substrate/Competitorn/a
Meas. Tech.ChEMBL_471723 (CHEMBL920995)
IC50 24±n/a nM
Citation Ohta, HIshizaka, TTatsuzuki, MYoshinaga, MIida, IYamaguchi, TTomishima, YFutaki, NToda, YSaito, S Imine derivatives as new potent and selective CB2 cannabinoid receptor agonists with an analgesic action. Bioorg Med Chem16:1111-24 (2008) 
 
Cannabinoid receptor 2
Name:Cannabinoid receptor 2
Type:G Protein-Coupled Receptor (GPCR)
Mol. Mass.:39690.94
Organism:Homo sapiens (Human)
Description:P34972
Residue:360
BDBM50375394
NameBDBM50375394
Synonyms:CHEMBL255347
TypeSmall organic molecule
Emp. Form.C19H21F3N2O2
Mol. Mass.366.3774
SMILESCC(C)c1o\c(=N/C(=O)c2cccc(c2)C(F)(F)F)n(CC2CC2)c1C