Reaction Details
TargetCannabinoid receptor 1
LigandBDBM50375392
Substrate/Competitorn/a
Meas. Tech.ChEMBL_471724 (CHEMBL920996)
IC50 870±n/a nM
Citation Ohta, HIshizaka, TTatsuzuki, MYoshinaga, MIida, IYamaguchi, TTomishima, YFutaki, NToda, YSaito, S Imine derivatives as new potent and selective CB2 cannabinoid receptor agonists with an analgesic action. Bioorg Med Chem16:1111-24 (2008) 
 
Cannabinoid receptor 1
Name:Cannabinoid receptor 1
Type:G Protein-Coupled Receptor (GPCR)
Mol. Mass.:52868.96
Organism:Homo sapiens (Human)
Description:P21554
Residue:472
BDBM50375392
NameBDBM50375392
Synonyms:CHEMBL410243
TypeSmall organic molecule
Emp. Form.C20H25F4N3O2
Mol. Mass.415.425
SMILESCCOCCn1n(C)c(c\c1=N/C(=O)c1cccc(c1F)C(F)(F)F)C(C)(C)C