Reaction Details
TargetAdenosine receptor A2b
LigandBDBM50375413
Substrate/Competitorn/a
Meas. Tech.ChEMBL_471789 (CHEMBL939997)
Ki 2.0±n/a nM
Citation Stefanachi, ABrea, JMCadavid, MICenteno, NBEsteve, CLoza, MIMartinez, ANieto, RRaviña, ESanz, FSegarra, VSotelo, EVidal, BCarotti, A 1-, 3- and 8-substituted-9-deazaxanthines as potent and selective antagonists at the human A2B adenosine receptor. Bioorg Med Chem16:2852-69 (2008) 
 
Adenosine receptor A2b
Name:Adenosine receptor A2b
Type:G Protein-Coupled Receptor (GPCR)
Mol. Mass.:36341.22
Organism:Homo sapiens (Human)
Description:n/a
Residue:332
BDBM50375413
NameBDBM50375413
Synonyms:CHEMBL260692
TypeSmall organic molecule
Emp. Form.C28H31N5O4
Mol. Mass.501.5768
SMILESCC(Oc1ccc(cc1)-c1cc2n(C)c(=O)n(C)c(=O)c2[nH]1)C(=O)N1CCN(CC1)c1ccc(C)cc1