Reaction Details
TargetAdenosine receptor A2a
LigandBDBM50003107
Substrate/Competitorn/a
Meas. Tech.ChEMBL_471788 (CHEMBL939996)
Ki 174±n/a nM
Citation Stefanachi, ABrea, JMCadavid, MICenteno, NBEsteve, CLoza, MIMartinez, ANieto, RRaviña, ESanz, FSegarra, VSotelo, EVidal, BCarotti, A 1-, 3- and 8-substituted-9-deazaxanthines as potent and selective antagonists at the human A2B adenosine receptor. Bioorg Med Chem16:2852-69 (2008) 
 
Adenosine receptor A2a
Name:Adenosine receptor A2a
Type:G Protein-Coupled Receptor (GPCR)
Mol. Mass.:44716.46
Organism:Homo sapiens (Human)
Description:P29274
Residue:412
BDBM50003107
NameBDBM50003107
Synonyms:CHEMBL260221
TypeSmall organic molecule
Emp. Form.C31H34F3N5O4
Mol. Mass.597.628
SMILESCCCn1c2cc([nH]c2c(=O)n(CCC)c1=O)-c1ccc(OCC(=O)N2CCN(CC2)c2ccc(cc2)C(F)(F)F)cc1