Reaction Details
TargetRibonuclease pancreatic
LigandBDBM50375419
Substrate/Competitorn/a
Meas. Tech.ChEMBL_471806 (CHEMBL940090)
IC50 341000±n/a nM
Citation Ghosh, KSDebnath, JDutta, PSahoo, BKDasgupta, S Exploring the potential of 3'-O-carboxy esters of thymidine as inhibitors of ribonuclease A and angiogenin. Bioorg Med Chem16:2819-28 (2008) 
 
Ribonuclease pancreatic
Name:Ribonuclease pancreatic
Type:Protein
Mol. Mass.:17653.66
Organism:Homo sapiens (Human)
Description:n/a
Residue:156
BDBM50375419
NameBDBM50375419
Synonyms:CHEMBL259808
TypeSmall organic molecule
Emp. Form.C17H18N2O6
Mol. Mass.346.3346
SMILESCc1cn([C@H]2C[C@H](OC(=O)c3ccccc3)[C@@H](CO)O2)c(=O)[nH]c1=O