Reaction Details
TargetAdenosine receptor A1
LigandBDBM50375515
Substrate/Competitorn/a
Meas. Tech.ChEMBL_472906 (CHEMBL922120)
Ki 5±n/a nM
Citation Ashton, TDBaker, SPHutchinson, SAScammells, PJ N6-substituted C5'-modified adenosines as A1 adenosine receptor agonists. Bioorg Med Chem16:1861-73 (2008) 
 
Adenosine receptor A1
Name:Adenosine receptor A1
Type:G Protein-Coupled Receptor (GPCR)
Mol. Mass.:36520.92
Organism:Homo sapiens (Human)
Description:P30542
Residue:326
BDBM50375515
NameBDBM50375515
Synonyms:CHEMBL410288
TypeSmall organic molecule
Emp. Form.C18H23N5O3S2
Mol. Mass.421.537
SMILESCSC[C@H]1O[C@H]([C@H](O)[C@@H]1O)n1cnc2c(N[C@H]3C[C@@H]4C[C@@H]3C3SC43)ncnc12