Reaction Details
TargetProstaglandin G/H synthase 2
LigandBDBM50375606
Substrate/Competitorn/a
Meas. Tech.ChEMBL_473076 (CHEMBL921788)
IC50 20±n/a nM
Citation Blobaum, ALMarnett, LJ Molecular determinants for the selective inhibition of cyclooxygenase-2 by lumiracoxib. J Biol Chem282:16379-90 (2007) 
 
Prostaglandin G/H synthase 2
Name:Prostaglandin G/H synthase 2
Type:Enzyme
Mol. Mass.:69003.89
Organism:Homo sapiens (Human)
Description:Recombinant Cox-2 provided by Cayman (Cayman Chemical Co.,Ann Arbor, MI).
Residue:604
BDBM50375606
NameBDBM50375606
Synonyms:CHEMBL76084
TypeSmall organic molecule
Emp. Form.C15H14ClNO2
Mol. Mass.275.73
SMILESCc1cccc(Cl)c1Nc1ccccc1CC(O)=O