Reaction Details
TargetProstaglandin G/H synthase 2
LigandBDBM50375600
Substrate/Competitorn/a
Meas. Tech.ChEMBL_473075 (CHEMBL921787)
IC50 33±n/a nM
Citation Blobaum, ALMarnett, LJ Molecular determinants for the selective inhibition of cyclooxygenase-2 by lumiracoxib. J Biol Chem282:16379-90 (2007) 
 
Prostaglandin G/H synthase 2
Name:Prostaglandin G/H synthase 2
Type:Protein
Mol. Mass.:69020.39
Organism:Mus musculus (Mouse)
Description:Q05769
Residue:604
BDBM50375600
NameBDBM50375600
Synonyms:CHEMBL407109
TypeSmall organic molecule
Emp. Form.C15H12Cl3NO2
Mol. Mass.344.62
SMILESCc1ccc(Nc2c(Cl)cc(Cl)cc2Cl)c(CC(O)=O)c1