Reaction Details
TargetAdenosine receptor A2a
LigandBDBM50229885
Substrate/Competitorn/a
Meas. Tech.ChEMBL_473538 (CHEMBL939092)
Ki>1000±n/a nM
Citation Tabrizi, MABaraldi, PGPreti, DRomagnoli, RSaponaro, GBaraldi, SMoorman, ARZaid, ANVarani, KBorea, PA 1,3-Dipropyl-8-(1-phenylacetamide-1H-pyrazol-3-yl)-xanthine derivatives as highly potent and selective human A(2B) adenosine receptor antagonists. Bioorg Med Chem16:2419-30 (2008) 
 
Adenosine receptor A2a
Name:Adenosine receptor A2a
Type:G Protein-Coupled Receptor (GPCR)
Mol. Mass.:44716.46
Organism:Homo sapiens (Human)
Description:P29274
Residue:412
BDBM50229885
NameBDBM50229885
Synonyms:CHEMBL260331 N-(benzo[d][1,3]dioxol-5-yl)-2-(5-(2,6-dioxo-1,3-dipropyl-2,3,6,7-tetrahydro-1H-purin-8-yl)-1-methyl-1H-pyrazol-3-yloxy)acetamide | N-Benzo[1,3]dioxol-5-yl-2-[5-(2,6-dioxo-1,3-dipropyl-2,3,6,7-tetrahydro-1H-purin-8-yl)-1-methyl-1H-pyrazol-3-yloxy]-acetamide
TypeSmall organic molecule
Emp. Form.C24H27N7O6
Mol. Mass.509.5145
SMILESCCCn1c2nc([nH]c2c(=O)n(CCC)c1=O)-c1cc(OCC(=O)Nc2ccc3OCOc3c2)nn1C