Reaction Details
TargetAdenosine receptor A2a
LigandBDBM50229886
Substrate/Competitorn/a
Meas. Tech.ChEMBL_473538 (CHEMBL939092)
Ki>1000±n/a nM
Citation Tabrizi, MABaraldi, PGPreti, DRomagnoli, RSaponaro, GBaraldi, SMoorman, ARZaid, ANVarani, KBorea, PA 1,3-Dipropyl-8-(1-phenylacetamide-1H-pyrazol-3-yl)-xanthine derivatives as highly potent and selective human A(2B) adenosine receptor antagonists. Bioorg Med Chem16:2419-30 (2008) 
 
Adenosine receptor A2a
Name:Adenosine receptor A2a
Type:G Protein-Coupled Receptor (GPCR)
Mol. Mass.:44716.46
Organism:Homo sapiens (Human)
Description:P29274
Residue:412
BDBM50229886
NameBDBM50229886
Synonyms:2-(3,4-Dimethoxy-phenyl)-N-[5-(2,6-dioxo-1,3-dipropyl-2,3,6,7-tetrahydro-1H-purin-8-yl)-1-methyl-1H-pyrazol-3-yl]-acetamide CHEMBL408186
TypeSmall organic molecule
Emp. Form.C25H31N7O5
Mol. Mass.509.5575
SMILESCCCn1c2nc([nH]c2c(=O)n(CCC)c1=O)-c1cc(NC(=O)Cc2ccc(OC)c(OC)c2)nn1C