Reaction Details
TargetAdenosine receptor A2a
LigandBDBM50375630
Substrate/Competitorn/a
Meas. Tech.ChEMBL_473538 (CHEMBL939092)
Ki>1000±n/a nM
Citation Tabrizi, MABaraldi, PGPreti, DRomagnoli, RSaponaro, GBaraldi, SMoorman, ARZaid, ANVarani, KBorea, PA 1,3-Dipropyl-8-(1-phenylacetamide-1H-pyrazol-3-yl)-xanthine derivatives as highly potent and selective human A(2B) adenosine receptor antagonists. Bioorg Med Chem16:2419-30 (2008) 
 
Adenosine receptor A2a
Name:Adenosine receptor A2a
Type:G Protein-Coupled Receptor (GPCR)
Mol. Mass.:44716.46
Organism:Homo sapiens (Human)
Description:P29274
Residue:412
BDBM50375630
NameBDBM50375630
Synonyms:CHEMBL409685
TypeSmall organic molecule
Emp. Form.C24H28ClN7O3
Mol. Mass.497.977
SMILESCCCn1c2nc([nH]c2c(=O)n(CCC)c1=O)-c1cc(CC)n(CC(=O)Nc2ccc(Cl)cc2)n1