Reaction Details
TargetAdenosine receptor A2a
LigandBDBM50375619
Substrate/Competitorn/a
Meas. Tech.ChEMBL_473538 (CHEMBL939092)
Ki>1000±n/a nM
Citation Tabrizi, MABaraldi, PGPreti, DRomagnoli, RSaponaro, GBaraldi, SMoorman, ARZaid, ANVarani, KBorea, PA 1,3-Dipropyl-8-(1-phenylacetamide-1H-pyrazol-3-yl)-xanthine derivatives as highly potent and selective human A(2B) adenosine receptor antagonists. Bioorg Med Chem16:2419-30 (2008) 
 
Adenosine receptor A2a
Name:Adenosine receptor A2a
Type:G Protein-Coupled Receptor (GPCR)
Mol. Mass.:44716.46
Organism:Homo sapiens (Human)
Description:P29274
Residue:412
BDBM50375619
NameBDBM50375619
Synonyms:CHEMBL264689
TypeSmall organic molecule
Emp. Form.C25H32N8O3
Mol. Mass.492.5734
SMILESCCCn1c2nc([nH]c2c(=O)n(CCC)c1=O)-c1cc(C)n(CC(=O)Nc2ccc(cc2)N(C)C)n1