Reaction Details
TargetAdenosine receptor A2b
LigandBDBM50375627
Substrate/Competitorn/a
Meas. Tech.ChEMBL_473541 (CHEMBL939195)
IC50>1000±n/a nM
Citation Tabrizi, MABaraldi, PGPreti, DRomagnoli, RSaponaro, GBaraldi, SMoorman, ARZaid, ANVarani, KBorea, PA 1,3-Dipropyl-8-(1-phenylacetamide-1H-pyrazol-3-yl)-xanthine derivatives as highly potent and selective human A(2B) adenosine receptor antagonists. Bioorg Med Chem16:2419-30 (2008) 
 
Adenosine receptor A2b
Name:Adenosine receptor A2b
Type:G Protein-Coupled Receptor (GPCR)
Mol. Mass.:36341.22
Organism:Homo sapiens (Human)
Description:n/a
Residue:332
BDBM50375627
NameBDBM50375627
Synonyms:CHEMBL260153
TypeSmall organic molecule
Emp. Form.C23H25BrClN7O3
Mol. Mass.562.847
SMILESCCCn1c2nc([nH]c2c(=O)n(CCC)c1=O)-c1nn(CC(=O)Nc2ccc(Cl)cc2)c(C)c1Br