Reaction Details
TargetAdenosine receptor A1
LigandBDBM50375634
Substrate/Competitorn/a
Meas. Tech.ChEMBL_473537 (CHEMBL939091)
Ki 675±n/a nM
Citation Tabrizi, MABaraldi, PGPreti, DRomagnoli, RSaponaro, GBaraldi, SMoorman, ARZaid, ANVarani, KBorea, PA 1,3-Dipropyl-8-(1-phenylacetamide-1H-pyrazol-3-yl)-xanthine derivatives as highly potent and selective human A(2B) adenosine receptor antagonists. Bioorg Med Chem16:2419-30 (2008) 
 
Adenosine receptor A1
Name:Adenosine receptor A1
Type:G Protein-Coupled Receptor (GPCR)
Mol. Mass.:36520.92
Organism:Homo sapiens (Human)
Description:P30542
Residue:326
BDBM50375634
NameBDBM50375634
Synonyms:CHEMBL258473
TypeSmall organic molecule
Emp. Form.C23H26ClN7O3
Mol. Mass.483.951
SMILESCCCn1c2nc([nH]c2c(=O)n(CCC)c1=O)-c1cc(C)n(CC(=O)Nc2cccc(Cl)c2)n1