Reaction Details
TargetAdenosine receptor A3
LigandBDBM50375620
Substrate/Competitorn/a
Meas. Tech.ChEMBL_473539 (CHEMBL939093)
Ki>1000±n/a nM
Citation Tabrizi, MABaraldi, PGPreti, DRomagnoli, RSaponaro, GBaraldi, SMoorman, ARZaid, ANVarani, KBorea, PA 1,3-Dipropyl-8-(1-phenylacetamide-1H-pyrazol-3-yl)-xanthine derivatives as highly potent and selective human A(2B) adenosine receptor antagonists. Bioorg Med Chem16:2419-30 (2008) 
 
Adenosine receptor A3
Name:Adenosine receptor A3
Type:G Protein-Coupled Receptor (GPCR)
Mol. Mass.:36197.32
Organism:Homo sapiens (Human)
Description:P0DMS8
Residue:318
BDBM50375620
NameBDBM50375620
Synonyms:CHEMBL412284
TypeSmall organic molecule
Emp. Form.C24H29N7O4
Mol. Mass.479.5316
SMILESCCCn1c2nc([nH]c2c(=O)n(CCC)c1=O)-c1cc(C)n(CC(=O)Nc2ccc(OC)cc2)n1