Reaction Details
TargetCalcium/calmodulin-dependent protein kinase kinase 2
LigandBDBM92455
Substrate/Competitorn/a
Meas. Tech.ChEMBL_473615 (CHEMBL940168)
IC50 127±n/a nM
Citation Fedorov, OMarsden, BPogacic, VRellos, PMüller, SBullock, ANSchwaller, JSundström, MKnapp, S A systematic interaction map of validated kinase inhibitors with Ser/Thr kinases. Proc Natl Acad Sci U S A104:20523-8 (2007) 
 
Calcium/calmodulin-dependent protein kinase kinase 2
Name:Calcium/calmodulin-dependent protein kinase kinase 2
Type:Enzyme Catalytic Domain
Mol. Mass.:64746.61
Organism:Homo sapiens (Human)
Description:gi_27437015
Residue:588
BDBM92455
NameBDBM92455
Synonyms:CHEMBL265470 | STO-609
TypeSmall organic molecule
Emp. Form.C19H10N2O3
Mol. Mass.314.2943
SMILESOC(=O)c1ccc2c3nc4ccccc4n3c(=O)c3cccc1c23