Reaction Details
TargetDual specificity protein kinase CLK1
LigandBDBM80396
Substrate/Competitorn/a
Meas. Tech.ChEMBL_473750 (CHEMBL936947)
IC50 20±n/a nM
Citation Fedorov, OMarsden, BPogacic, VRellos, PMüller, SBullock, ANSchwaller, JSundström, MKnapp, S A systematic interaction map of validated kinase inhibitors with Ser/Thr kinases. Proc Natl Acad Sci U S A104:20523-8 (2007) 
 
Dual specificity protein kinase CLK1
Name:Dual specificity protein kinase CLK1
Type:PROTEIN
Mol. Mass.:57124.52
Organism:Mus musculus
Description:ChEMBL_1502245
Residue:483
BDBM80396
NameBDBM80396
Synonyms:(1E)-1-(3-ethyl-5-methoxy-1,3-benzothiazol-2-ylidene)-2-propanone (1E)-1-(3-ethyl-5-methoxy-1,3-benzothiazol-2-ylidene)propan-2-one MLS000518915 cid_1893667
TypeSmall organic molecule
Emp. Form.C13H15NO2S
Mol. Mass.249.329
SMILESCCN1C(Sc2ccc(OC)cc12)=CC(C)=O