Reaction Details
TargetCalcium/calmodulin-dependent protein kinase kinase 2
LigandBDBM50038199
Substrate/Competitorn/a
Meas. Tech.ChEMBL_473615 (CHEMBL940168)
IC50 200±n/a nM
Citation Fedorov, OMarsden, BPogacic, VRellos, PMüller, SBullock, ANSchwaller, JSundström, MKnapp, S A systematic interaction map of validated kinase inhibitors with Ser/Thr kinases. Proc Natl Acad Sci U S A104:20523-8 (2007) 
 
Calcium/calmodulin-dependent protein kinase kinase 2
Name:Calcium/calmodulin-dependent protein kinase kinase 2
Type:Enzyme Catalytic Domain
Mol. Mass.:64746.61
Organism:Homo sapiens (Human)
Description:gi_27437015
Residue:588
BDBM50038199
NameBDBM50038199
Synonyms:5-(2,5-Dihydroxy-benzylamino)-2-hydroxy-benzoic acid 5-(N-2',5'-dihydroxybenzyl)aminosalicylic acid Lavendustin C
TypeSmall organic molecule
Emp. Form.C14H13NO5
Mol. Mass.275.2567
SMILESOC(=O)c1cc(NCc2cc(O)ccc2O)ccc1O