Reaction Details
TargetReceptor tyrosine-protein kinase erbB-2
LigandBDBM50375639
Substrate/Competitorn/a
Meas. Tech.ChEMBL_473602 (CHEMBL939367)
IC50 3400±n/a nM
Citation Fedorov, OMarsden, BPogacic, VRellos, PMüller, SBullock, ANSchwaller, JSundström, MKnapp, S A systematic interaction map of validated kinase inhibitors with Ser/Thr kinases. Proc Natl Acad Sci U S A104:20523-8 (2007) 
 
Receptor tyrosine-protein kinase erbB-2
Name:Receptor tyrosine-protein kinase erbB-2
Type:n/a
Mol. Mass.:137894.47
Organism:Homo sapiens (Human)
Description:P04626
Residue:1255
BDBM50375639
NameBDBM50375639
Synonyms:CHEMBL258940
TypeSmall organic molecule
Emp. Form.C18H19ClFN7
Mol. Mass.387.842
SMILESCN1CCC(CC1)Nc1ncc2ncnc(Nc3ccc(F)c(Cl)c3)c2n1