Reaction Details
TargetMitogen-activated protein kinase 14
LigandBDBM50105742
Substrate/Competitorn/a
Meas. Tech.ChEMBL_473592 (CHEMBL939357)
IC50 44±n/a nM
Citation Fedorov, OMarsden, BPogacic, VRellos, PMüller, SBullock, ANSchwaller, JSundström, MKnapp, S A systematic interaction map of validated kinase inhibitors with Ser/Thr kinases. Proc Natl Acad Sci U S A104:20523-8 (2007) 
 
Mitogen-activated protein kinase 14
Name:Mitogen-activated protein kinase 14
Type:Serine/threonine-protein kinase
Mol. Mass.:41286.76
Organism:Homo sapiens (Human)
Description:Q16539
Residue:360
BDBM50105742
NameBDBM50105742
Synonyms:4-[4-(4-Fluoro-phenyl)-5-(2-methoxy-pyrimidin-4-yl)-imidazol-1-yl]-cyclohexanol trans -1-(4-hydroxycyclohexyl)-4-(4-fluorophenyl)-5-(2-methoxypyrimidin-4-yl)imidazole
TypeSmall organic molecule
Emp. Form.C20H21FN4O2
Mol. Mass.368.4047
SMILESCOc1nccc(n1)-c1c(ncn1[C@H]1CC[C@H](O)CC1)-c1ccc(F)cc1