Reaction Details
TargetDual specificity mitogen-activated protein kinase kinase 2
LigandBDBM50375643
Substrate/Competitorn/a
Meas. Tech.ChEMBL_473714 (CHEMBL936811)
IC50 220±n/a nM
Citation Fedorov, OMarsden, BPogacic, VRellos, PMüller, SBullock, ANSchwaller, JSundström, MKnapp, S A systematic interaction map of validated kinase inhibitors with Ser/Thr kinases. Proc Natl Acad Sci U S A104:20523-8 (2007) 
 
Dual specificity mitogen-activated protein kinase kinase 2
Name:Dual specificity mitogen-activated protein kinase kinase 2
Type:Enzyme Catalytic Domain
Mol. Mass.:44423.61
Organism:Homo sapiens (Human)
Description:gi_13489054
Residue:400
BDBM50375643
NameBDBM50375643
Synonyms:CHEMBL261237 | SL-327
TypeSmall organic molecule
Emp. Form.C16H12F3N3S
Mol. Mass.335.347
SMILESNc1ccc(SC(=N)C(C#N)c2ccccc2C(F)(F)F)cc1