Reaction Details
TargetCasein kinase I isoform alpha
LigandBDBM50375645
Substrate/Competitorn/a
Meas. Tech.ChEMBL_473616 (CHEMBL940169)
Ki 80000±n/a nM
Citation Fedorov, OMarsden, BPogacic, VRellos, PMüller, SBullock, ANSchwaller, JSundström, MKnapp, S A systematic interaction map of validated kinase inhibitors with Ser/Thr kinases. Proc Natl Acad Sci U S A104:20523-8 (2007) 
 
Casein kinase I isoform alpha
Name:Casein kinase I isoform alpha
Type:Serine/threonine-protein kinase
Mol. Mass.:38936.59
Organism:Homo sapiens (Human)
Description:P48729
Residue:337
BDBM50375645
NameBDBM50375645
Synonyms:CHEMBL219301 | US11542290, Compound A-3
TypeSmall organic molecule
Emp. Form.C12H13ClN2O2S
Mol. Mass.284.762
SMILESNCCNS(=O)(=O)c1cccc2c(Cl)cccc12