Reaction Details
TargetMitogen-activated protein kinase 14
LigandBDBM50229978
Substrate/Competitorn/a
Meas. Tech.ChEMBL_473592 (CHEMBL939357)
Ki 310±n/a nM
Citation Fedorov, OMarsden, BPogacic, VRellos, PMüller, SBullock, ANSchwaller, JSundström, MKnapp, S A systematic interaction map of validated kinase inhibitors with Ser/Thr kinases. Proc Natl Acad Sci U S A104:20523-8 (2007) 
 
Mitogen-activated protein kinase 14
Name:Mitogen-activated protein kinase 14
Type:Serine/threonine-protein kinase
Mol. Mass.:41286.76
Organism:Homo sapiens (Human)
Description:Q16539
Residue:360
BDBM50229978
NameBDBM50229978
Synonyms:5-(2-PHENYLPYRAZOLO[1,5-A]PYRIDIN-3-YL)-1H-PYRAZOLO[3,4-C]PYRIDAZIN-3-AMINE 5-(2-phenylH-pyrazolo[1,5-a]pyridin-3-yl)-1H-pyrazolo[3,4-c]pyridazin-3-amine | CHEMBL259551
TypeSmall organic molecule
Emp. Form.C18H13N7
Mol. Mass.327.3427
SMILESNc1n[nH]c2nnc(cc12)-c1c(nn2ccccc12)-c1ccccc1