Reaction Details
TargetRho-associated protein kinase 1
LigandBDBM50319631
Substrate/Competitorn/a
Meas. Tech.ChEMBL_473819 (CHEMBL921079)
Ki 140±n/a nM
Citation Fedorov, OMarsden, BPogacic, VRellos, PMüller, SBullock, ANSchwaller, JSundström, MKnapp, S A systematic interaction map of validated kinase inhibitors with Ser/Thr kinases. Proc Natl Acad Sci U S A104:20523-8 (2007) 
 
Rho-associated protein kinase 1
Name:Rho-associated protein kinase 1
Type:Serine/threonine-protein kinase
Mol. Mass.:158156.77
Organism:Homo sapiens (Human)
Description:Q13464
Residue:1354
BDBM50319631
NameBDBM50319631
Synonyms:CHEMBL1083134 | trans-4-[(1R)-1-Aminoethyl]-N-4-pyridinylcyclohexanecar boxamide dihydrochloride
TypeSmall organic molecule
Emp. Form.C14H21N3O
Mol. Mass.247.336
SMILESC[C@@H](N)[C@H]1CC[C@@H](CC1)C(=O)Nc1ccncc1