Reaction Details
TargetEpidermal growth factor receptor
LigandBDBM3556
Substrate/Competitorn/a
Meas. Tech.ChEMBL_473572 (CHEMBL939337)
IC50 0.006±n/a nM
Citation Fedorov, OMarsden, BPogacic, VRellos, PMüller, SBullock, ANSchwaller, JSundström, MKnapp, S A systematic interaction map of validated kinase inhibitors with Ser/Thr kinases. Proc Natl Acad Sci U S A104:20523-8 (2007) 
 
Epidermal growth factor receptor
Name:Epidermal growth factor receptor
Type:Receptor Kinase Domain
Mol. Mass.:134279.59
Organism:Homo sapiens (Human)
Description:P00533
Residue:1210
BDBM3556
NameBDBM3556
Synonyms:4-[(3-Bromophenyl)amino]-6,7-diethoxyquinazoline CHEMBL35820 PD153035 Analog | PD153035 Analog 56
TypeSmall organic molecule
Emp. Form.C18H18BrN3O2
Mol. Mass.388.258
SMILESCCOc1cc2ncnc(Nc3cccc(Br)c3)c2cc1OCC