Reaction Details
TargetProtein kinase C beta type
LigandBDBM3033
Substrate/Competitorn/a
Meas. Tech.ChEMBL_473595 (CHEMBL939360)
IC50 2±n/a nM
Citation Fedorov, OMarsden, BPogacic, VRellos, PMüller, SBullock, ANSchwaller, JSundström, MKnapp, S A systematic interaction map of validated kinase inhibitors with Ser/Thr kinases. Proc Natl Acad Sci U S A104:20523-8 (2007) 
 
Protein kinase C beta type
Name:Protein kinase C beta type
Type:Enzyme
Mol. Mass.:76873.67
Organism:Homo sapiens (Human)
Description:The recombinant human PKC enzymes were produced using a baculovirus expression system in SF9 cells
Residue:671
BDBM3033
NameBDBM3033
Synonyms:3-{23-methyl-14-oxo-3,13,23-triazahexacyclo[14.7.0.0^{2,10}.0^{4,9}.0^{11,15}.0^{17,22}]tricosa-1(16),2(10),4(9),5,7,11(15),17,19,21-nonaen-3-yl}propanenitrile Go 6976 | Indolocarbazole deriv.
TypeSmall organic molecule
Emp. Form.C24H18N4O
Mol. Mass.378.4259
SMILESCn1c2ccccc2c2c3C(=O)NCc3c3c4ccccc4n(CCC#N)c3c12