Reaction Details
TargetGlycogen synthase kinase-3 beta
LigandBDBM6878
Substrate/Competitorn/a
Meas. Tech.ChEMBL_473637 (CHEMBL937654)
IC50 140±n/a nM
Citation Fedorov, OMarsden, BPogacic, VRellos, PMüller, SBullock, ANSchwaller, JSundström, MKnapp, S A systematic interaction map of validated kinase inhibitors with Ser/Thr kinases. Proc Natl Acad Sci U S A104:20523-8 (2007) 
 
Glycogen synthase kinase-3 beta
Name:Glycogen synthase kinase-3 beta
Type:Enzyme
Mol. Mass.:46756.38
Organism:Homo sapiens (Human)
Description:P49841
Residue:420
BDBM6878
NameBDBM6878
Synonyms:1-Acyl-1H-[1,2,4]triazole-3,5-diamine Analogue 3n | 5-amino-N-(2,6-difluorophenyl)-3-[(4-sulfamoylphenyl)amino]-1H-1,2,4-triazole-1-carbothioamide
TypeSmall organic molecule
Emp. Form.C15H13F2N7O2S2
Mol. Mass.425.436
SMILESNc1nc(Nc2ccc(cc2)S(N)(=O)=O)nn1C(=S)Nc1c(F)cccc1F