Reaction Details
TargetCyclin-dependent kinase 5 activator 1
LigandBDBM50375670
Substrate/Competitorn/a
Meas. Tech.ChEMBL_473638 (CHEMBL937655)
IC50 25000±n/a nM
Citation Fedorov, OMarsden, BPogacic, VRellos, PMüller, SBullock, ANSchwaller, JSundström, MKnapp, S A systematic interaction map of validated kinase inhibitors with Ser/Thr kinases. Proc Natl Acad Sci U S A104:20523-8 (2007) 
 
Cyclin-dependent kinase 5 activator 1
Name:Cyclin-dependent kinase 5 activator 1
Type:Enzyme Subunit
Mol. Mass.:34077.43
Organism:Homo sapiens (Human)
Description:Q15078
Residue:307
BDBM50375670
NameBDBM50375670
Synonyms:CHEMBL261425
TypeSmall organic molecule
Emp. Form.C17H11ClN2O
Mol. Mass.294.735
SMILESClc1[nH]c2ccccc2c1\C=C1\C(=O)Nc2ccccc12