Reaction Details
TargetMyosin light chain kinase, smooth muscle
LigandBDBM2580
Substrate/Competitorn/a
Meas. Tech.ChEMBL_473673 (CHEMBL921716)
Ki 17±n/a nM
Citation Fedorov, OMarsden, BPogacic, VRellos, PMüller, SBullock, ANSchwaller, JSundström, MKnapp, S A systematic interaction map of validated kinase inhibitors with Ser/Thr kinases. Proc Natl Acad Sci U S A104:20523-8 (2007) 
 
Myosin light chain kinase, smooth muscle
Name:Myosin light chain kinase, smooth muscle
Type:Protein
Mol. Mass.:210702.56
Organism:Homo sapiens (Human)
Description:Q15746
Residue:1914
BDBM2580
NameBDBM2580
Synonyms:K252a | methyl (15R,16S,18S)-16-hydroxy-15-methyl-3-oxo-28-oxa-4,14,19-triazaoctacyclo[12.11.2.1^{15,18}.0^{2,6}.0^{7,27}.0^{8,13}.0^{19,26}.0^{20,25}]octacosa-1(26),2(6),7(27),8(13),9,11,20(25),21,23-nonaene-16-carboxylate
TypeSmall organic molecule
Emp. Form.C27H21N3O5
Mol. Mass.467.4727
SMILESCOC(=O)[C@]1(O)C[C@@H]2O[C@@]1(C)n1c3ccccc3c3c4CNC(=O)c4c4c5ccccc5n2c4c13