Reaction Details
TargetVascular endothelial growth factor receptor 2
LigandBDBM50375688
Substrate/Competitorn/a
Meas. Tech.ChEMBL_473898 (CHEMBL950174)
IC50 1±n/a nM
Citation La, DSBelzile, JBready, JVCoxon, ADeMelfi, TDoerr, NEstrada, JFlynn, JCFlynn, SRGraceffa, RFHarriman, SPLarrow, JFLong, AMMartin, MWMorrison, MJPatel, VFRoveto, PMWang, LWeiss, MMWhittington, DATeffera, YZhao, ZPolverino, AJHarmange, JC Novel 2,3-dihydro-1,4-benzoxazines as potent and orally bioavailable inhibitors of tumor-driven angiogenesis. J Med Chem51:1695-705 (2008) 
 
Vascular endothelial growth factor receptor 2
Name:Vascular endothelial growth factor receptor 2
Type:Receptor Tyrosine Kinase
Mol. Mass.:151510.97
Organism:Homo sapiens (Human)
Description:P35968
Residue:1356
BDBM50375688
NameBDBM50375688
Synonyms:CHEMBL270058
TypeSmall organic molecule
Emp. Form.C27H25N3O5
Mol. Mass.471.5045
SMILESCOc1cc2nccc(Oc3ccc4N(CCOc4c3)C(=O)Nc3ccccc3C)c2cc1OC