Reaction Details
TargetSodium-dependent dopamine transporter
LigandBDBM50124566
Substrate/Competitorn/a
Meas. Tech.ChEMBL_473950 (CHEMBL950331)
Ki>10000±n/a nM
Citation Fish, PVRyckmans, TStobie, AWakenhut, F [4-(Phenoxy)pyridin-3-yl]methylamines: a new class of selective noradrenaline reuptake inhibitors. Bioorg Med Chem Lett18:1795-8 (2008) 
 
Sodium-dependent dopamine transporter
Name:Sodium-dependent dopamine transporter
Type:Multi-pass membrane protein
Mol. Mass.:68497.11
Organism:Homo sapiens (Human)
Description:Q01959
Residue:620
BDBM50124566
NameBDBM50124566
Synonyms:(R)-2-((R)-(2-ethoxyphenoxy)(phenyl)methyl)morpholine 2-((2-ethoxyphenoxy)(phenyl)methyl)morpholine 2-[2-ethoxyphenoxy(phenyl)methyl]-1,4-oxazinane REBOXETINE | rac-syn-2-((2-ethoxyphenoxy)(phenyl)methyl)morpholine
TypeSmall organic molecule
Emp. Form.C19H23NO3
Mol. Mass.313.3908
SMILESCCOc1ccccc1OC(C1CNCCO1)c1ccccc1