Reaction Details
TargetMitogen-activated protein kinase 14
LigandBDBM50375796
Substrate/Competitorn/a
Meas. Tech.ChEMBL_474267 (CHEMBL935072)
IC50 0.2±n/a nM
Citation Chen, MHFitzgerald, PSingh, SBO'Neill, EASchwartz, CDThompson, CMO'Keefe, SJZaller, DMDoherty, JB Synthesis and biological activity of quinolinone and dihydroquinolinone p38 MAP kinase inhibitors. Bioorg Med Chem Lett18:2222-6 (2008) 
 
Mitogen-activated protein kinase 14
Name:Mitogen-activated protein kinase 14
Type:Serine/threonine-protein kinase
Mol. Mass.:41286.76
Organism:Homo sapiens (Human)
Description:Q16539
Residue:360
BDBM50375796
NameBDBM50375796
Synonyms:CHEMBL255403
TypeSmall organic molecule
Emp. Form.C26H22Cl3N3O3
Mol. Mass.530.83
SMILESC[C@@H](N)C(=O)NCCOc1cc(-c2ccccc2Cl)c2ccc(=O)n(-c3c(Cl)cccc3Cl)c2c1