Reaction Details
TargetCannabinoid receptor 1
LigandBDBM50375877
Substrate/Competitorn/a
Meas. Tech.ChEMBL_474602 (CHEMBL921108)
Ki>10000±n/a nM
Citation Huffman, JWThompson, ALWiley, JLMartin, BR Synthesis and pharmacology of 1-deoxy analogs of CP-47,497 and CP-55,940. Bioorg Med Chem16:322-35 (2008) 
 
Cannabinoid receptor 1
Name:Cannabinoid receptor 1
Type:G Protein-Coupled Receptor (GPCR)
Mol. Mass.:52856.55
Organism:Rattus norvegicus (rat)
Description:P20272
Residue:473
BDBM50375877
NameBDBM50375877
Synonyms:CHEMBL408060 | JWH-296
TypeSmall organic molecule
Emp. Form.C18H28O
Mol. Mass.260.4143
SMILESCCCC(C)(C)c1ccc(cc1)[C@H]1CCC[C@@H](O)C1