Reaction Details
TargetCannabinoid receptor 1
LigandBDBM50375879
Substrate/Competitorn/a
Meas. Tech.ChEMBL_474602 (CHEMBL921108)
Ki>10000±n/a nM
Citation Huffman, JWThompson, ALWiley, JLMartin, BR Synthesis and pharmacology of 1-deoxy analogs of CP-47,497 and CP-55,940. Bioorg Med Chem16:322-35 (2008) 
 
Cannabinoid receptor 1
Name:Cannabinoid receptor 1
Type:G Protein-Coupled Receptor (GPCR)
Mol. Mass.:52856.55
Organism:Rattus norvegicus (rat)
Description:P20272
Residue:473
BDBM50375879
NameBDBM50375879
Synonyms:CHEMBL259296 | JWH-231
TypeSmall organic molecule
Emp. Form.C16H24O
Mol. Mass.232.3612
SMILESCC(C)(C)c1ccc(cc1)[C@H]1CCC[C@@H](O)C1