Reaction Details
TargetCannabinoid receptor 2
LigandBDBM50375860
Substrate/Competitorn/a
Meas. Tech.ChEMBL_474603 (CHEMBL921109)
Ki 221±n/a nM
Citation Huffman, JWThompson, ALWiley, JLMartin, BR Synthesis and pharmacology of 1-deoxy analogs of CP-47,497 and CP-55,940. Bioorg Med Chem16:322-35 (2008) 
 
Cannabinoid receptor 2
Name:Cannabinoid receptor 2
Type:G Protein-Coupled Receptor (GPCR)
Mol. Mass.:39690.94
Organism:Homo sapiens (Human)
Description:P34972
Residue:360
BDBM50375860
NameBDBM50375860
Synonyms:CHEMBL260253 | JWH-344
TypeSmall organic molecule
Emp. Form.C23H38O2
Mol. Mass.346.5466
SMILESCCCCCC(C)(C)c1ccc(cc1)[C@@H]1C[C@H](O)CC[C@H]1CCCO