Reaction Details
TargetCannabinoid receptor 2
LigandBDBM50375857
Substrate/Competitorn/a
Meas. Tech.ChEMBL_474603 (CHEMBL921109)
Ki 1362±n/a nM
Citation Huffman, JWThompson, ALWiley, JLMartin, BR Synthesis and pharmacology of 1-deoxy analogs of CP-47,497 and CP-55,940. Bioorg Med Chem16:322-35 (2008) 
 
Cannabinoid receptor 2
Name:Cannabinoid receptor 2
Type:G Protein-Coupled Receptor (GPCR)
Mol. Mass.:39690.94
Organism:Homo sapiens (Human)
Description:P34972
Residue:360
BDBM50375857
NameBDBM50375857
Synonyms:CHEMBL263885 | JWH-343
TypeSmall organic molecule
Emp. Form.C20H32O2
Mol. Mass.304.4669
SMILESCCC(C)(C)c1ccc(cc1)[C@@H]1C[C@H](O)CC[C@H]1CCCO