Reaction Details
TargetCannabinoid receptor 2
LigandBDBM50375871
Substrate/Competitorn/a
Meas. Tech.ChEMBL_474603 (CHEMBL921109)
Ki 3759±n/a nM
Citation Huffman, JWThompson, ALWiley, JLMartin, BR Synthesis and pharmacology of 1-deoxy analogs of CP-47,497 and CP-55,940. Bioorg Med Chem16:322-35 (2008) 
 
Cannabinoid receptor 2
Name:Cannabinoid receptor 2
Type:G Protein-Coupled Receptor (GPCR)
Mol. Mass.:39690.94
Organism:Homo sapiens (Human)
Description:P34972
Residue:360
BDBM50375871
NameBDBM50375871
Synonyms:CHEMBL407763 | JWH-295
TypeSmall organic molecule
Emp. Form.C17H26O
Mol. Mass.246.3877
SMILESCCC(C)(C)c1ccc(cc1)[C@@H]1CCC[C@@H](O)C1