Reaction Details
TargetGonadotropin-releasing hormone receptor
LigandBDBM50128007
Substrate/Competitorn/a
Meas. Tech.ChEMBL_474609 (CHEMBL921115)
Ki 24±n/a nM
Citation Feher, MGao, YBaber, JCShirley, WASaunders, J The use of ligand-based de novo design for scaffold hopping and sidechain optimization: two case studies. Bioorg Med Chem16:422-7 (2008) 
 
Gonadotropin-releasing hormone receptor
Name:Gonadotropin-releasing hormone receptor
Type:Enzyme
Mol. Mass.:37749.45
Organism:Homo sapiens (Human)
Description:P30968
Residue:328
BDBM50128007
NameBDBM50128007
Synonyms:1-(2,6-difluoro-benzyl)-5-(2,3-dihydro-benzo[1,4]dioxin-6-yl)-6-methyl-3-{2-[methyl-(2-pyridin-2-yl-ethyl)-amino]-ethyl}-1H-pyrimidine-2,4-dione | CHEMBL22929
TypeSmall organic molecule
Emp. Form.C30H30F2N4O4
Mol. Mass.548.5804
SMILESCN(CCc1ccccn1)CCn1c(=O)c(c(C)n(Cc2c(F)cccc2F)c1=O)-c1ccc2OCCOc2c1