Reaction Details
TargetGonadotropin-releasing hormone receptor
LigandBDBM50375882
Substrate/Competitorn/a
Meas. Tech.ChEMBL_474609 (CHEMBL921115)
Ki 1±n/a nM
Citation Feher, MGao, YBaber, JCShirley, WASaunders, J The use of ligand-based de novo design for scaffold hopping and sidechain optimization: two case studies. Bioorg Med Chem16:422-7 (2008) 
 
Gonadotropin-releasing hormone receptor
Name:Gonadotropin-releasing hormone receptor
Type:Enzyme
Mol. Mass.:37749.45
Organism:Homo sapiens (Human)
Description:P30968
Residue:328
BDBM50375882
NameBDBM50375882
Synonyms:CHEMBL411526
TypeSmall organic molecule
Emp. Form.C28H37N5O5
Mol. Mass.523.6239
SMILESCNCCNc1nc(OC)c(NC(=O)c2ccc(Cc3cc4c(cc3C)C(C)(C)OC4(C)C)o2)c(OC)n1