Reaction Details
TargetBeta-3 adrenergic receptor
LigandBDBM25392
Substrate/Competitorn/a
Meas. Tech.ChEMBL_474618 (CHEMBL936719)
EC50 5.8±n/a nM
Citation Perrone, MGSantandrea, EBleve, LVitale, PColabufo, NAJockers, RMilazzo, FMSciarroni, AFScilimati, A Stereospecific synthesis and bio-activity of novel beta(3)-adrenoceptor agonists and inverse agonists. Bioorg Med Chem16:2473-88 (2008) 
 
Beta-3 adrenergic receptor
Name:Beta-3 adrenergic receptor
Type:G Protein-Coupled Receptor (GPCR)
Mol. Mass.:43534.88
Organism:Homo sapiens (Human)
Description:n/a
Residue:408
BDBM25392
NameBDBM25392
Synonyms:4-[1-hydroxy-2-(isopropylamino)ethyl]pyrocatechol;hydrochloride 4-{1-hydroxy-2-[(propan-2-yl)amino]ethyl}benzene-1,2-diol, 2 ISOPROTERONOL Isoproterenol Isoproterenol,(+) Norisodrine | Novodrin
TypeSmall organic molecule
Emp. Form.C11H17NO3
Mol. Mass.211.2576
SMILESCC(C)NCC(O)c1ccc(O)c(O)c1